Reaction Details
TargetCannabinoid receptor 1
LigandBDBM50398227
Substrate/Competitorn/a
Meas. Tech.ChEMBL_874193 (CHEMBL2187925)
Ki 33±n/a nM
Citation Rempel, VVolz, NHinz, SKarcz, TMeliciani, INieger, MWenzel, WBräse, SMüller, CE 7-Alkyl-3-benzylcoumarins: a versatile scaffold for the development of potent and selective cannabinoid receptor agonists and antagonists. J Med Chem55:7967-77 (2012) 
 
Cannabinoid receptor 1
Name:Cannabinoid receptor 1
Type:G Protein-Coupled Receptor (GPCR)
Mol. Mass.:52868.96
Organism:Homo sapiens (Human)
Description:P21554
Residue:472
BDBM50398227
NameBDBM50398227
Synonyms:CHEMBL2177259
TypeSmall organic molecule
Emp. Form.C22H23ClO3
Mol. Mass.370.869
SMILESCCCCCc1cc(OC)c2cc(Cc3ccccc3Cl)c(=O)oc2c1