Reaction Details
TargetCannabinoid receptor 1
LigandBDBM50398231
Substrate/Competitorn/a
Meas. Tech.ChEMBL_874193 (CHEMBL2187925)
Ki 713±n/a nM
Citation Rempel, VVolz, NHinz, SKarcz, TMeliciani, INieger, MWenzel, WBräse, SMüller, CE 7-Alkyl-3-benzylcoumarins: a versatile scaffold for the development of potent and selective cannabinoid receptor agonists and antagonists. J Med Chem55:7967-77 (2012) 
 
Cannabinoid receptor 1
Name:Cannabinoid receptor 1
Type:G Protein-Coupled Receptor (GPCR)
Mol. Mass.:52868.96
Organism:Homo sapiens (Human)
Description:P21554
Residue:472
BDBM50398231
NameBDBM50398231
Synonyms:CHEMBL2177255
TypeSmall organic molecule
Emp. Form.C23H26O3
Mol. Mass.350.4507
SMILESCCCCCc1cc(OC)c2cc(Cc3cccc(C)c3)c(=O)oc2c1