Reaction Details
TargetCannabinoid receptor 1
LigandBDBM50398239
Substrate/Competitorn/a
Meas. Tech.ChEMBL_874193 (CHEMBL2187925)
Ki>10000±n/a nM
Citation Rempel, VVolz, NHinz, SKarcz, TMeliciani, INieger, MWenzel, WBräse, SMüller, CE 7-Alkyl-3-benzylcoumarins: a versatile scaffold for the development of potent and selective cannabinoid receptor agonists and antagonists. J Med Chem55:7967-77 (2012) 
 
Cannabinoid receptor 1
Name:Cannabinoid receptor 1
Type:G Protein-Coupled Receptor (GPCR)
Mol. Mass.:52868.96
Organism:Homo sapiens (Human)
Description:P21554
Residue:472
BDBM50398239
NameBDBM50398239
Synonyms:CHEMBL2181697
TypeSmall organic molecule
Emp. Form.C19H18O5
Mol. Mass.326.3432
SMILESCOc1cccc(Cc2cc3c(OC)cc(CO)cc3oc2=O)c1