Reaction Details
TargetCannabinoid receptor 1
LigandBDBM50398229
Substrate/Competitorn/a
Meas. Tech.ChEMBL_874195 (CHEMBL2187927)
EC50 56±n/a nM
Citation Rempel, VVolz, NHinz, SKarcz, TMeliciani, INieger, MWenzel, WBräse, SMüller, CE 7-Alkyl-3-benzylcoumarins: a versatile scaffold for the development of potent and selective cannabinoid receptor agonists and antagonists. J Med Chem55:7967-77 (2012) 
 
Cannabinoid receptor 1
Name:Cannabinoid receptor 1
Type:G Protein-Coupled Receptor (GPCR)
Mol. Mass.:52868.96
Organism:Homo sapiens (Human)
Description:P21554
Residue:472
BDBM50398229
NameBDBM50398229
Synonyms:CHEMBL2177257
TypeSmall organic molecule
Emp. Form.C23H26O4
Mol. Mass.366.4501
SMILESCCCCCc1cc(OC)c2cc(Cc3ccccc3OC)c(=O)oc2c1