Reaction Details
TargetCannabinoid receptor 2
LigandBDBM50398215
Substrate/Competitorn/a
Meas. Tech.ChEMBL_874192 (CHEMBL2187924)
Ki 49±n/a nM
Citation Rempel, VVolz, NHinz, SKarcz, TMeliciani, INieger, MWenzel, WBräse, SMüller, CE 7-Alkyl-3-benzylcoumarins: a versatile scaffold for the development of potent and selective cannabinoid receptor agonists and antagonists. J Med Chem55:7967-77 (2012) 
 
Cannabinoid receptor 2
Name:Cannabinoid receptor 2
Type:G Protein-Coupled Receptor (GPCR)
Mol. Mass.:39690.94
Organism:Homo sapiens (Human)
Description:P34972
Residue:360
BDBM50398215
NameBDBM50398215
Synonyms:CHEMBL2181546
TypeSmall organic molecule
Emp. Form.C26H30O4
Mol. Mass.406.514
SMILESCCCCC1(CCCCC1)c1cc(O)c2cc(Cc3ccccc3O)c(=O)oc2c1