Reaction Details
TargetCannabinoid receptor 2
LigandBDBM50398242
Substrate/Competitorn/a
Meas. Tech.ChEMBL_874192 (CHEMBL2187924)
Ki>10000±n/a nM
Citation Rempel, VVolz, NHinz, SKarcz, TMeliciani, INieger, MWenzel, WBräse, SMüller, CE 7-Alkyl-3-benzylcoumarins: a versatile scaffold for the development of potent and selective cannabinoid receptor agonists and antagonists. J Med Chem55:7967-77 (2012) 
 
Cannabinoid receptor 2
Name:Cannabinoid receptor 2
Type:G Protein-Coupled Receptor (GPCR)
Mol. Mass.:39690.94
Organism:Homo sapiens (Human)
Description:P34972
Residue:360
BDBM50398242
NameBDBM50398242
Synonyms:CHEMBL2181550
TypeSmall organic molecule
Emp. Form.C18H16O4
Mol. Mass.296.3172
SMILESCOc1cccc(Cc2cc3c(OC)cccc3oc2=O)c1