Reaction Details
TargetAurora kinase B
LigandBDBM14210
Substrate/Competitorn/a
Meas. Tech.ChEMBL_874449 (CHEMBL2184772)
IC50 51±n/a nM
Citation Elkins, JMSantaguida, SMusacchio, AKnapp, S Crystal structure of human aurora B in complex with INCENP and VX-680. J Med Chem55:7841-8 (2012) 
 
Aurora kinase B
Name:Aurora kinase B
Type:Protein
Mol. Mass.:39327.72
Organism:Homo sapiens (Human)
Description:Q96GD4
Residue:344
BDBM14210
NameBDBM14210
Synonyms:4-(4-(N-benzoylamino)anilino)-6-methoxy-7-(3-(1-morpholino)propoxy)-quinazoline N-[4-({6-methoxy-7-[3-(morpholin-4-yl)propoxy]quinazolin-4-yl}amino)phenyl]benzamide | ZM447439
TypeSmall organic molecule
Emp. Form.C29H31N5O4
Mol. Mass.513.5875
SMILESCOc1cc2c(Nc3ccc(NC(=O)c4ccccc4)cc3)ncnc2cc1OCCCN1CCOCC1