Reaction Details
TargetAurora kinase B-A
LigandBDBM13534
Substrate/Competitorn/a
Meas. Tech.ChEMBL_874448 (CHEMBL2184333)
IC50 19±n/a nM
Citation Elkins, JMSantaguida, SMusacchio, AKnapp, S Crystal structure of human aurora B in complex with INCENP and VX-680. J Med Chem55:7841-8 (2012) 
 
Aurora kinase B-A
Name:Aurora kinase B-A
Type:PROTEIN
Mol. Mass.:41755.74
Organism:Xenopus laevis
Description:ChEMBL_874448
Residue:361
BDBM13534
NameBDBM13534
Synonyms:CHEMBL572878 N-[4-[[4-(4-methylpiperazino)-6-[(5-methyl-1H-pyrazol-3-yl)amino]pyrimidin-2-yl]thio]phenyl]cyclopropanecarboxamide VX680 | cyclopropane carboxylic acid {4-[4-(4-methyl-piperazin-1-yl)-6-(5-methyl-2H-pyrazol-3-ylamino)-pyrimidin-2ylsulphanyl]-phenyl}-amide
TypeSmall organic molecule
Emp. Form.C23H28N8OS
Mol. Mass.464.586
SMILESCN1CCN(CC1)c1cc(Nc2cc(C)n[nH]2)nc(Sc2ccc(NC(=O)C3CC3)cc2)n1