Reaction Details
TargetC-C chemokine receptor type 1
LigandBDBM50099480
Substrate/Competitorn/a
Meas. Tech.ChEMBL_875652 (CHEMBL2184883)
IC50 450±n/a nM
Citation Pease, JHoruk, R Chemokine receptor antagonists. J Med Chem55:9363-92 (2012) 
 
C-C chemokine receptor type 1
Name:C-C chemokine receptor type 1
Type:Enzyme
Mol. Mass.:41180.69
Organism:Homo sapiens (Human)
Description:P32246
Residue:355
BDBM50099480
NameBDBM50099480
Synonyms:2-(Benzothiazol-2-ylsulfanyl)-N-[1-(3,4-dichloro-benzyl)-piperidin-4-yl]-acetamide | CHEMBL20532
TypeSmall organic molecule
Emp. Form.C21H21Cl2N3OS2
Mol. Mass.466.447
SMILESClc1ccc(CN2CCC(CC2)NC(=O)CSc2nc3ccccc3s2)cc1Cl