Reaction Details
TargetC-X-C chemokine receptor type 3
LigandBDBM50358609
Substrate/Competitorn/a
Meas. Tech.ChEMBL_875617 (CHEMBL2184848)
Ki 0.4±n/a nM
Citation Pease, JHoruk, R Chemokine receptor antagonists. J Med Chem55:9363-92 (2012) 
 
C-X-C chemokine receptor type 3
Name:C-X-C chemokine receptor type 3
Type:Enzyme Catalytic Domain
Mol. Mass.:40665.65
Organism:Homo sapiens (Human)
Description:n/a
Residue:368
BDBM50358609
NameBDBM50358609
Synonyms:CHEMBL1921858
TypeSmall organic molecule
Emp. Form.C23H31Cl2N7O
Mol. Mass.492.445
SMILESCC[C@H]1CN(CCN1C1CCN(Cc2ccc(Cl)cc2)CC1)c1nc(N)c(nc1Cl)C(N)=O