Reaction Details
TargetC-C chemokine receptor type 9
LigandBDBM50398334
Substrate/Competitorn/a
Meas. Tech.ChEMBL_875625 (CHEMBL2184856)
IC50 2.8±n/a nM
Citation Pease, JHoruk, R Chemokine receptor antagonists. J Med Chem55:9363-92 (2012) 
 
C-C chemokine receptor type 9
Name:C-C chemokine receptor type 9
Type:PROTEIN
Mol. Mass.:42023.90
Organism:Homo sapiens (Human)
Description:ChEMBL_1510356
Residue:369
BDBM50398334
NameBDBM50398334
Synonyms:CHEMBL2178578
TypeSmall organic molecule
Emp. Form.C22H21ClN2O4S
Mol. Mass.444.931
SMILESCC(C)(C)c1ccc(cc1)S(=O)(=O)Nc1ccc(Cl)cc1C(=O)c1cc[n+]([O-])cc1