Reaction Details
TargetC-C chemokine receptor type 5
LigandBDBM50185666
Substrate/Competitorn/a
Meas. Tech.ChEMBL_875647 (CHEMBL2184878)
IC50 0.32±n/a nM
Citation Pease, JHoruk, R Chemokine receptor antagonists. J Med Chem55:9363-92 (2012) 
 
C-C chemokine receptor type 5
Name:C-C chemokine receptor type 5
Type:Enzyme
Mol. Mass.:40540.21
Organism:Homo sapiens (Human)
Description:P51681
Residue:352
BDBM50185666
NameBDBM50185666
Synonyms:(R)-N-(1-(3-(3,5-difluorophenyl)-3-(4-(methylsulfonyl)phenyl)propyl)piperidin-4-yl)-N-ethyl-2-(4-(methylsulfonyl)phenyl)acetamide | CHEMBL212689
TypeSmall organic molecule
Emp. Form.C32H38F2N2O5S2
Mol. Mass.632.781
SMILESCCN(C1CCN(CC[C@H](c2ccc(cc2)S(C)(=O)=O)c2cc(F)cc(F)c2)CC1)C(=O)Cc1ccc(cc1)S(C)(=O)=O