Reaction Details
TargetC-C chemokine receptor type 5
LigandBDBM50398339
Substrate/Competitorn/a
Meas. Tech.ChEMBL_875647 (CHEMBL2184878)
Ki 1±n/a nM
Citation Pease, JHoruk, R Chemokine receptor antagonists. J Med Chem55:9363-92 (2012) 
 
C-C chemokine receptor type 5
Name:C-C chemokine receptor type 5
Type:Enzyme
Mol. Mass.:40540.21
Organism:Homo sapiens (Human)
Description:P51681
Residue:352
BDBM50398339
NameBDBM50398339
Synonyms:CHEMBL2178569
TypeSmall organic molecule
Emp. Form.C30H31ClN2O4
Mol. Mass.519.031
SMILESCC1(C)CN(CC\C=C2/c3cccnc3COc3ccc(cc23)C(O)=O)C[C@@H]([C@H]1O)c1ccc(Cl)cc1