Reaction Details
TargetCytochrome P450 2D6
LigandBDBM50209971
Substrate/Competitorn/a
Meas. Tech.ChEMBL_875635 (CHEMBL2184866)
IC50 40±n/a nM
Citation Pease, JHoruk, R Chemokine receptor antagonists. J Med Chem55:9363-92 (2012) 
 
Cytochrome P450 2D6
Name:Cytochrome P450 2D6
Type:Protein
Mol. Mass.:55774.82
Organism:Homo sapiens (Human)
Description:P10635
Residue:497
BDBM50209971
NameBDBM50209971
Synonyms:1-((1R,2S)-2-(((S)-3-(4-fluorobenzyl)piperidin-1-yl)methyl)cyclohexyl)-3-(3-acetylphenyl)urea | CHEMBL250689
TypeSmall organic molecule
Emp. Form.C28H36FN3O2
Mol. Mass.465.6027
SMILESCC(=O)c1cccc(NC(=O)N[C@@H]2CCCC[C@H]2CN2CCC[C@@H](Cc3ccc(F)cc3)C2)c1