Reaction Details
TargetC-C chemokine receptor type 1
LigandBDBM50398344
Substrate/Competitorn/a
Meas. Tech.ChEMBL_875636 (CHEMBL2184867)
IC50 5±n/a nM
Citation Pease, JHoruk, R Chemokine receptor antagonists. J Med Chem55:9363-92 (2012) 
 
C-C chemokine receptor type 1
Name:C-C chemokine receptor type 1
Type:Enzyme
Mol. Mass.:41180.69
Organism:Homo sapiens (Human)
Description:P32246
Residue:355
BDBM50398344
NameBDBM50398344
Synonyms:CHEMBL2178572
TypeSmall organic molecule
Emp. Form.C24H34F3N3O3
Mol. Mass.469.5403
SMILESCO[C@@H]1COCC[C@@H]1NC1CC[C@](C1)(C(C)C)C(=O)N1CCc2ncc(cc2C1)C(F)(F)F