Reaction Details
TargetC-C chemokine receptor type 1
LigandBDBM50208999
Substrate/Competitorn/a
Meas. Tech.ChEMBL_875652 (CHEMBL2184883)
Ki 1±n/a nM
Citation Pease, JHoruk, R Chemokine receptor antagonists. J Med Chem55:9363-92 (2012) 
 
C-C chemokine receptor type 1
Name:C-C chemokine receptor type 1
Type:Enzyme
Mol. Mass.:41180.69
Organism:Homo sapiens (Human)
Description:P32246
Residue:355
BDBM50208999
NameBDBM50208999
Synonyms:(R)-1-(2-(2-(4-(4-fluorobenzyl)-2-methylpiperazin-1-yl)-2-oxoethoxy)-5-chlorophenyl)urea BX-471 CHEMBL232656
TypeSmall organic molecule
Emp. Form.C21H24ClFN4O3
Mol. Mass.434.892
SMILESC[C@@H]1CN(Cc2ccc(F)cc2)CCN1C(=O)COc1ccc(Cl)cc1NC(N)=O