Reaction Details
TargetC-C chemokine receptor type 3
LigandBDBM50398349
Substrate/Competitorn/a
Meas. Tech.ChEMBL_875615 (CHEMBL2184846)
Ki 1.8±n/a nM
Citation Pease, JHoruk, R Chemokine receptor antagonists. J Med Chem55:9363-92 (2012) 
 
C-C chemokine receptor type 3
Name:C-C chemokine receptor type 3
Type:Enzyme
Mol. Mass.:41053.88
Organism:Homo sapiens (Human)
Description:P51677
Residue:355
BDBM50398349
NameBDBM50398349
Synonyms:CHEMBL2178580
TypeSmall organic molecule
Emp. Form.C28H30FN5O2
Mol. Mass.487.5685
SMILES[#6]-c1ccc(nn1)-[#6](=O)-[#7]-1-[#6]-[#6]\[#6](-[#6]-[#6]-1)=[#6]\[#6](=O)-[#7]-[#6@@H]-1-[#6]-[#6]-[#7](-[#6]-c2ccc3cc(F)ccc3c2)-[#6]-1