Reaction Details
TargetRAC-alpha serine/threonine-protein kinase
LigandBDBM50398381
Substrate/Competitorn/a
Meas. Tech.ChEMBL_875897 (CHEMBL2187635)
IC50 3±n/a nM
Citation Blake, JFXu, RBencsik, JRXiao, DKallan, NCSchlachter, SMitchell, ISSpencer, KLBanka, ALWallace, EMGloor, SLMartinson, MWoessner, RDVigers, GPBrandhuber, BJLiang, JSafina, BSLi, JZhang, BChabot, CDo, SLee, LOeh, JSampath, DLee, BBLin, KLiederer, BMSkelton, NJ Discovery and preclinical pharmacology of a selective ATP-competitive Akt inhibitor (GDC-0068) for the treatment of human tumors. J Med Chem55:8110-27 (2012) 
 
RAC-alpha serine/threonine-protein kinase
Name:RAC-alpha serine/threonine-protein kinase
Type:Enzyme
Mol. Mass.:55681.25
Organism:Homo sapiens (Human)
Description:P31749
Residue:480
BDBM50398381
NameBDBM50398381
Synonyms:CHEMBL2177388
TypeSmall organic molecule
Emp. Form.C24H31ClFN5O
Mol. Mass.459.987
SMILESCC(C)NC[C@@H](C(=O)N1CCN(CC1)c1ncnc2CC[C@@H](CF)c12)c1ccc(Cl)cc1