Reaction Details
TargetDihydrofolate reductase
LigandBDBM18050
Substrate/Competitorn/a
Meas. Tech.ChEMBL_876347 (CHEMBL2185821)
Ki 0.000340±n/a nM
Citation Corona, PGibellini, FCavalli, ASaxena, PCarta, ALoriga, MLuciani, RPaglietti, GGuerrieri, DNerini, EGupta, SHannaert, VMichels, PAFerrari, SCosti, PM Structure-based selectivity optimization of piperidine-pteridine derivatives as potent Leishmania pteridine reductase inhibitors. J Med Chem55:8318-29 (2012) 
 
Dihydrofolate reductase
Name:Dihydrofolate reductase
Type:Enzyme
Mol. Mass.:21453.99
Organism:Homo sapiens (Human)
Description:Recombinant human DHFR.
Residue:187
BDBM18050
NameBDBM18050
Synonyms:2-[(4-{[(2,4-diaminopteridin-6-yl)methyl](methyl)amino}phenyl)formamido]pentanedioic acid MTX cid_126941
TypeSmall organic molecule
Emp. Form.C20H22N8O5
Mol. Mass.454.4393
SMILESCN(Cc1cnc2nc(N)nc(N)c2n1)c1ccc(cc1)C(=O)N[C@@H](CCC(O)=O)C(O)=O