Reaction Details
TargetPteridine reductase 1
LigandBDBM50398389
Substrate/Competitorn/a
Meas. Tech.ChEMBL_876348 (CHEMBL2185822)
Ki 100±n/a nM
Citation Corona, PGibellini, FCavalli, ASaxena, PCarta, ALoriga, MLuciani, RPaglietti, GGuerrieri, DNerini, EGupta, SHannaert, VMichels, PAFerrari, SCosti, PM Structure-based selectivity optimization of piperidine-pteridine derivatives as potent Leishmania pteridine reductase inhibitors. J Med Chem55:8318-29 (2012) 
 
Pteridine reductase 1
Name:Pteridine reductase 1
Type:PROTEIN
Mol. Mass.:30459.34
Organism:Leishmania major
Description:ChEMBL_1470027
Residue:288
BDBM50398389
NameBDBM50398389
Synonyms:CHEMBL2178601
TypeSmall organic molecule
Emp. Form.C25H30N8O5
Mol. Mass.522.5563
SMILESCCOC(=O)CN(Cc1cnc2nc(N)nc(N)c2n1)c1ccc(cc1)C(=O)N1CCC(CC1)C(=O)OC