Reaction Details
TargetDihydrofolate reductase
LigandBDBM50398391
Substrate/Competitorn/a
Meas. Tech.ChEMBL_876347 (CHEMBL2185821)
Ki 4330±n/a nM
Citation Corona, PGibellini, FCavalli, ASaxena, PCarta, ALoriga, MLuciani, RPaglietti, GGuerrieri, DNerini, EGupta, SHannaert, VMichels, PAFerrari, SCosti, PM Structure-based selectivity optimization of piperidine-pteridine derivatives as potent Leishmania pteridine reductase inhibitors. J Med Chem55:8318-29 (2012) 
 
Dihydrofolate reductase
Name:Dihydrofolate reductase
Type:Enzyme
Mol. Mass.:21453.99
Organism:Homo sapiens (Human)
Description:Recombinant human DHFR.
Residue:187
BDBM50398391
NameBDBM50398391
Synonyms:CHEMBL2178602
TypeSmall organic molecule
Emp. Form.C23H28N8O4
Mol. Mass.480.5196
SMILESCOC(=O)C1CCN(CC1)C(=O)c1ccc(cc1)N(CCO)Cc1cnc2nc(N)nc(N)c2n1