Reaction Details
TargetDihydrofolate reductase
LigandBDBM50398394
Substrate/Competitorn/a
Meas. Tech.ChEMBL_876347 (CHEMBL2185821)
Ki 800±n/a nM
Citation Corona, PGibellini, FCavalli, ASaxena, PCarta, ALoriga, MLuciani, RPaglietti, GGuerrieri, DNerini, EGupta, SHannaert, VMichels, PAFerrari, SCosti, PM Structure-based selectivity optimization of piperidine-pteridine derivatives as potent Leishmania pteridine reductase inhibitors. J Med Chem55:8318-29 (2012) 
 
Dihydrofolate reductase
Name:Dihydrofolate reductase
Type:Enzyme
Mol. Mass.:21453.99
Organism:Homo sapiens (Human)
Description:Recombinant human DHFR.
Residue:187
BDBM50398394
NameBDBM50398394
Synonyms:CHEMBL1232702
TypeSmall organic molecule
Emp. Form.C22H26N8O3
Mol. Mass.450.4936
SMILESCOC(=O)C1CCN(CC1)C(=O)c1ccc(cc1)N(C)Cc1cnc2nc(N)nc(N)c2n1