Reaction Details
TargetPteridine reductase 1
LigandBDBM50398396
Substrate/Competitorn/a
Meas. Tech.ChEMBL_876348 (CHEMBL2185822)
Ki 210±n/a nM
Citation Corona, PGibellini, FCavalli, ASaxena, PCarta, ALoriga, MLuciani, RPaglietti, GGuerrieri, DNerini, EGupta, SHannaert, VMichels, PAFerrari, SCosti, PM Structure-based selectivity optimization of piperidine-pteridine derivatives as potent Leishmania pteridine reductase inhibitors. J Med Chem55:8318-29 (2012) 
 
Pteridine reductase 1
Name:Pteridine reductase 1
Type:PROTEIN
Mol. Mass.:30459.34
Organism:Leishmania major
Description:ChEMBL_1470027
Residue:288
BDBM50398396
NameBDBM50398396
Synonyms:CHEMBL2178600
TypeSmall organic molecule
Emp. Form.C20H23N9O3
Mol. Mass.437.4551
SMILESCOC(=O)C1CCN(CC1)C(=O)c1ccc(NCc2cnc3nc(N)nc(N)c3n2)cn1