Reaction Details
TargetMitogen-activated protein kinase 14
LigandBDBM50398457
Substrate/Competitorn/a
Meas. Tech.ChEMBL_872749 (CHEMBL2185574)
IC50 11±n/a nM
Citation Selig, RGoettert, MSchattel, VSchollmeyer, DAlbrecht, WLaufer, S A frozen analogue approach to aminopyridinylimidazoles leading to novel and promising p38 MAP kinase inhibitors. J Med Chem55:8429-39 (2012) 
 
Mitogen-activated protein kinase 14
Name:Mitogen-activated protein kinase 14
Type:Serine/threonine-protein kinase
Mol. Mass.:41286.76
Organism:Homo sapiens (Human)
Description:Q16539
Residue:360
BDBM50398457
NameBDBM50398457
Synonyms:CHEMBL2179118
TypeSmall organic molecule
Emp. Form.C29H21FN4O2S
Mol. Mass.508.566
SMILESCS(=O)(=O)c1ccc(cc1)-c1nc(c([nH]1)-c1ccc(F)cc1)-c1ccnc2[nH]c(cc12)-c1ccccc1