Reaction Details
TargetMitogen-activated protein kinase 14
LigandBDBM50398465
Substrate/Competitorn/a
Meas. Tech.ChEMBL_872749 (CHEMBL2185574)
IC50 345±n/a nM
Citation Selig, RGoettert, MSchattel, VSchollmeyer, DAlbrecht, WLaufer, S A frozen analogue approach to aminopyridinylimidazoles leading to novel and promising p38 MAP kinase inhibitors. J Med Chem55:8429-39 (2012) 
 
Mitogen-activated protein kinase 14
Name:Mitogen-activated protein kinase 14
Type:Serine/threonine-protein kinase
Mol. Mass.:41286.76
Organism:Homo sapiens (Human)
Description:Q16539
Residue:360
BDBM50398465
NameBDBM50398465
Synonyms:CHEMBL2179129
TypeSmall organic molecule
Emp. Form.C29H21FN4
Mol. Mass.444.5022
SMILESFc1ccc(cc1)-c1[nH]c(nc1-c1ccnc2[nH]c(Cc3ccccc3)cc12)-c1ccccc1