Reaction Details
TargetMitogen-activated protein kinase 14
LigandBDBM50104356
Substrate/Competitorn/a
Meas. Tech.ChEMBL_872749 (CHEMBL2185574)
IC50 154±n/a nM
Citation Selig, RGoettert, MSchattel, VSchollmeyer, DAlbrecht, WLaufer, S A frozen analogue approach to aminopyridinylimidazoles leading to novel and promising p38 MAP kinase inhibitors. J Med Chem55:8429-39 (2012) 
 
Mitogen-activated protein kinase 14
Name:Mitogen-activated protein kinase 14
Type:Serine/threonine-protein kinase
Mol. Mass.:41286.76
Organism:Homo sapiens (Human)
Description:Q16539
Residue:360
BDBM50104356
NameBDBM50104356
Synonyms:4-[5-(4-Fluoro-phenyl)-2-phenyl-3H-imidazol-4-yl]-pyridine | CHEMBL416169
TypeSmall organic molecule
Emp. Form.C20H14FN3
Mol. Mass.315.3437
SMILESFc1ccc(cc1)-c1[nH]c(nc1-c1ccncc1)-c1ccccc1