Reaction Details
TargetBeta-secretase 1
LigandBDBM16254
Substrate/Competitorn/a
Meas. Tech.ChEMBL_872750 (CHEMBL2185575)
Ki 0.120000±n/a nM
Citation Ghosh, AKVenkateswara Rao, KYadav, NDAnderson, DDGavande, NHuang, XTerzyan, STang, J Structure-based design of highly selectiveß-secretase inhibitors: synthesis, biological evaluation, and protein-ligand X-ray crystal structure. J Med Chem55:9195-207 (2012) 
 
Beta-secretase 1
Name:Beta-secretase 1
Type:Protein
Mol. Mass.:55755.10
Organism:Homo sapiens (Human)
Description:P56817
Residue:501
BDBM16254
NameBDBM16254
Synonyms:(2,5-dimethyl-1,3-oxazol-4-yl)methyl N-[(1R)-1-{[(1R,3S,4S)-3-hydroxy-1,6-dimethyl-1-{[(1S)-2-methyl-1-[(2-methylpropyl)carbamoyl]propyl]carbamoyl}heptan-4-yl]carbamoyl}-2-methanesulfonylethyl]carbamate N2-[(2R,4S,5S)-5-{[N-{[(2,5-dimethyl-1,3-oxazol-4-yl)methoxy]carbonyl}-3-(methylsulfonyl)-L-alanyl]amino}-4-hydroxy-2,7-dimethyloctanoyl]-N-(2-methylpropyl)-L-valinamide | oxazolylmethyl-bearing inhibitor 6
TypeSmall organic molecule
Emp. Form.C30H53N5O9S
Mol. Mass.659.835
SMILESCC(C)CNC(=O)[C@@H](NC(=O)[C@H](C)C[C@H](O)[C@H](CC(C)C)NC(=O)[C@H](CS(C)(=O)=O)NC(=O)OCc1nc(C)oc1C)C(C)C