Reaction Details
TargetTransient receptor potential cation channel subfamily V member 1
LigandBDBM50398542
Substrate/Competitorn/a
Meas. Tech.ChEMBL_872981 (CHEMBL2188275)
Ki 2±n/a nM
Citation Kim, MSRyu, HKang, DWCho, SHSeo, SPark, YSKim, MYKwak, EJKim, YSBhondwe, RSKim, HSPark, SGSon, KChoi, SDeAndrea-Lazarus, IAPearce, LVBlumberg, PMFrank, RBahrenberg, GStockhausen, HKögel, BYSchiene, KChristoph, TLee, J 2-(3-fluoro-4-methylsulfonylaminophenyl)propanamides as potent transient receptor potential vanilloid 1 (TRPV1) antagonists: structure-activity relationships of 2-amino derivatives in the N-(6-trifluoromethylpyridin-3-ylmethyl) C-region. J Med Chem55:8392-408 (2012) 
 
Transient receptor potential cation channel subfamily V member 1
Name:Transient receptor potential cation channel subfamily V member 1
Type:Protein
Mol. Mass.:94960.75
Organism:Homo sapiens (Human)
Description:Q8NER1
Residue:839
BDBM50398542
NameBDBM50398542
Synonyms:CHEMBL2177414
TypeSmall organic molecule
Emp. Form.C27H34F4N4O5S
Mol. Mass.602.641
SMILESCC(C(=O)NCc1ccc(nc1N1CCC(CC1)OC(=O)C(C)(C)C)C(F)(F)F)c1ccc(NS(C)(=O)=O)c(F)c1