Reaction Details
TargetCorticotropin-releasing factor receptor 1
LigandBDBM50398579
Substrate/Competitorn/a
Meas. Tech.ChEMBL_873519 (CHEMBL2187021)
IC50 43±n/a nM
Citation Takahashi, YHashizume, MShin, KTerauchi, TTakeda, KHibi, SMurata-Tai, KFujisawa, MShikata, KTaguchi, RIno, MShibata, HYonaga, M Design, synthesis, and structure-activity relationships of novel pyrazolo[5,1-b]thiazole derivatives as potent and orally active corticotropin-releasing factor 1 receptor antagonists. J Med Chem55:8450-63 (2012) 
 
Corticotropin-releasing factor receptor 1
Name:Corticotropin-releasing factor receptor 1
Type:Enzyme
Mol. Mass.:50744.31
Organism:Homo sapiens (Human)
Description:P34998
Residue:444
BDBM50398579
NameBDBM50398579
Synonyms:CHEMBL2179182
TypeSmall organic molecule
Emp. Form.C25H33N3O5S
Mol. Mass.487.612
SMILESCOCc1cc(OC)c(-c2csc3c(N(CC4CC4)CC4CCCO4)c(OC)nn23)c(OC)c1