Reaction Details
TargetCorticotropin-releasing factor receptor 1
LigandBDBM50398587
Substrate/Competitorn/a
Meas. Tech.ChEMBL_873519 (CHEMBL2187021)
IC50 46±n/a nM
Citation Takahashi, YHashizume, MShin, KTerauchi, TTakeda, KHibi, SMurata-Tai, KFujisawa, MShikata, KTaguchi, RIno, MShibata, HYonaga, M Design, synthesis, and structure-activity relationships of novel pyrazolo[5,1-b]thiazole derivatives as potent and orally active corticotropin-releasing factor 1 receptor antagonists. J Med Chem55:8450-63 (2012) 
 
Corticotropin-releasing factor receptor 1
Name:Corticotropin-releasing factor receptor 1
Type:Enzyme
Mol. Mass.:50744.31
Organism:Homo sapiens (Human)
Description:P34998
Residue:444
BDBM50398587
NameBDBM50398587
Synonyms:CHEMBL2179197 | US8530504, 4
TypeSmall organic molecule
Emp. Form.C26H35N3O4S
Mol. Mass.485.639
SMILESCOCc1cc(OC)c(-c2csc3c(N(CC4CC4)CC4CCOCC4)c(C)nn23)c(OC)c1