Reaction Details
Target5-hydroxytryptamine receptor 4
LigandBDBM50398590
Substrate/Competitorn/a
Meas. Tech.ChEMBL_873980 (CHEMBL2185669)
Ki 5.5±n/a nM
Citation Brodney, MAJohnson, DESawant-Basak, ACoffman, KJDrummond, EMHudson, ELFisher, KENoguchi, HWaizumi, NMcDowell, LLPapanikolaou, APettersen, BASchmidt, AWTseng, EStutzman-Engwall, KRubitski, DMVanase-Frawley, MAGrimwood, S Identification of multiple 5-HT4 partial agonist clinical candidates for the treatment of Alzheimer's disease. J Med Chem55:9240-54 (2012) 
 
5-hydroxytryptamine receptor 4
Name:5-hydroxytryptamine receptor 4
Type:Enzyme
Mol. Mass.:43767.54
Organism:Homo sapiens (Human)
Description:Q13639
Residue:388
BDBM50398590
NameBDBM50398590
Synonyms:CHEMBL2179583
TypeSmall organic molecule
Emp. Form.C23H33FN4O4
Mol. Mass.448.5309
SMILESCC(C)n1c2ccc(F)cc2n(C(=O)NCC2CCN(CC3(O)CCOCC3)CC2)c1=O