Reaction Details
Target5-hydroxytryptamine receptor 4
LigandBDBM50398596
Substrate/Competitorn/a
Meas. Tech.ChEMBL_873995 (CHEMBL2185684)
EC50 0.98±n/a nM
Citation Brodney, MAJohnson, DESawant-Basak, ACoffman, KJDrummond, EMHudson, ELFisher, KENoguchi, HWaizumi, NMcDowell, LLPapanikolaou, APettersen, BASchmidt, AWTseng, EStutzman-Engwall, KRubitski, DMVanase-Frawley, MAGrimwood, S Identification of multiple 5-HT4 partial agonist clinical candidates for the treatment of Alzheimer's disease. J Med Chem55:9240-54 (2012) 
 
5-hydroxytryptamine receptor 4
Name:5-hydroxytryptamine receptor 4
Type:Enzyme
Mol. Mass.:43767.54
Organism:Homo sapiens (Human)
Description:Q13639
Residue:388
BDBM50398596
NameBDBM50398596
Synonyms:CHEMBL2179589
TypeSmall organic molecule
Emp. Form.C23H34N2O5
Mol. Mass.418.5265
SMILESCC(C)COc1cccc2onc(OCC3CCN(CC4(O)CCOCC4)CC3)c12