Reaction Details
Target5-hydroxytryptamine receptor 4
LigandBDBM50398598
Substrate/Competitorn/a
Meas. Tech.ChEMBL_873980 (CHEMBL2185669)
Ki 0.46±n/a nM
Citation Brodney, MAJohnson, DESawant-Basak, ACoffman, KJDrummond, EMHudson, ELFisher, KENoguchi, HWaizumi, NMcDowell, LLPapanikolaou, APettersen, BASchmidt, AWTseng, EStutzman-Engwall, KRubitski, DMVanase-Frawley, MAGrimwood, S Identification of multiple 5-HT4 partial agonist clinical candidates for the treatment of Alzheimer's disease. J Med Chem55:9240-54 (2012) 
 
5-hydroxytryptamine receptor 4
Name:5-hydroxytryptamine receptor 4
Type:Enzyme
Mol. Mass.:43767.54
Organism:Homo sapiens (Human)
Description:Q13639
Residue:388
BDBM50398598
NameBDBM50398598
Synonyms:CHEMBL2152922
TypeSmall organic molecule
Emp. Form.C23H32N2O6
Mol. Mass.432.51
SMILESOC1(CN2CCC(COc3noc4cccc(O[C@@H]5CCOC5)c34)CC2)CCOCC1