Reaction Details
TargetBeta-secretase 1
LigandBDBM50398613
Substrate/Competitorn/a
Meas. Tech.ChEMBL_874518 (CHEMBL2185270)
IC50 240±n/a nM
Citation Brodney, MABarreiro, GOgilvie, KHajos-Korcsok, EMurray, JVajdos, FAmbroise, CChristoffersen, CFisher, KLanyon, LLiu, JNolan, CEWithka, JMBorzilleri, KAEfremov, IOborski, CEVarghese, AO'Neill, BT Spirocyclic sulfamides asß-secretase 1 (BACE-1) inhibitors for the treatment of Alzheimer's disease: utilization of structure based drug design, WaterMap, and CNS penetration studies to identify centrally efficacious inhibitors. J Med Chem55:9224-39 (2012) 
 
Beta-secretase 1
Name:Beta-secretase 1
Type:Protein
Mol. Mass.:55755.10
Organism:Homo sapiens (Human)
Description:P56817
Residue:501
BDBM50398613
NameBDBM50398613
Synonyms:CHEMBL2177484
TypeSmall organic molecule
Emp. Form.C21H26FN3O3S
Mol. Mass.419.513
SMILESC[C@H]1C[C@@]2(CN(C)S(=O)(=O)N2c2cccc(F)c2)CCN1Cc1ccc(O)cc1