Reaction Details
TargetBeta-secretase 1
LigandBDBM50398624
Substrate/Competitorn/a
Meas. Tech.ChEMBL_874519 (CHEMBL2185271)
IC50 1700±n/a nM
Citation Brodney, MABarreiro, GOgilvie, KHajos-Korcsok, EMurray, JVajdos, FAmbroise, CChristoffersen, CFisher, KLanyon, LLiu, JNolan, CEWithka, JMBorzilleri, KAEfremov, IOborski, CEVarghese, AO'Neill, BT Spirocyclic sulfamides asß-secretase 1 (BACE-1) inhibitors for the treatment of Alzheimer's disease: utilization of structure based drug design, WaterMap, and CNS penetration studies to identify centrally efficacious inhibitors. J Med Chem55:9224-39 (2012) 
 
Beta-secretase 1
Name:Beta-secretase 1
Type:Protein
Mol. Mass.:55755.10
Organism:Homo sapiens (Human)
Description:P56817
Residue:501
BDBM50398624
NameBDBM50398624
Synonyms:CHEMBL2177472
TypeSmall organic molecule
Emp. Form.C26H27ClFN3O2S
Mol. Mass.500.028
SMILESC[C@H]1C[C@@]2(CNS(=O)(=O)N2c2cccc(F)c2)CCN1Cc1cccc(c1)-c1ccccc1Cl