Reaction Details
TargetcAMP-specific 3',5'-cyclic phosphodiesterase 4D
LigandBDBM50398649
Substrate/Competitorn/a
Meas. Tech.ChEMBL_874726 (CHEMBL2187959)
IC50 15700±n/a nM
Citation Meng, FHou, JShao, YXWu, PYHuang, MZhu, XCai, YLi, ZXu, JLiu, PLuo, HBWan, YKe, H Structure-based discovery of highly selective phosphodiesterase-9A inhibitors and implications for inhibitor design. J Med Chem55:8549-58 (2012) 
 
cAMP-specific 3',5'-cyclic phosphodiesterase 4D
Name:cAMP-specific 3',5'-cyclic phosphodiesterase 4D
Type:Protein
Mol. Mass.:91092.69
Organism:Homo sapiens (Human)
Description:Q08499
Residue:809
BDBM50398649
NameBDBM50398649
Synonyms:CHEMBL2178115 | US9617269, Compound WYQ-94-D
TypeSmall organic molecule
Emp. Form.C21H19ClN6O3
Mol. Mass.438.867
SMILESCOc1ccc(NC(=O)C(C)Nc2nc3n(ncc3c(=O)[nH]2)-c2ccccc2Cl)cc1