Reaction Details
TargetUridine 5'-monophosphate synthase
LigandBDBM50398699
Substrate/Competitorn/a
Meas. Tech.ChEMBL_874989 (CHEMBL2183865)
Ki 220000±n/a nM
Citation Purohit, MKPoduch, EWei, LWCrandall, IETo, TKain, KCPai, EFKotra, LP Novel cytidine-based orotidine-5'-monophosphate decarboxylase inhibitors with an unusual twist. J Med Chem55:9988-97 (2012) 
 
Uridine 5'-monophosphate synthase
Name:Uridine 5'-monophosphate synthase
Type:Enzyme
Mol. Mass.:52224.99
Organism:Homo sapiens (Human)
Description:P11172
Residue:480
BDBM50398699
NameBDBM50398699
Synonyms:CHEMBL214393
TypeSmall organic molecule
Emp. Form.C9H13N2O9P
Mol. Mass.324.1813
SMILESO[C@@H]1[C@@H](COP(O)(O)=O)O[C@H]([C@@H]1O)n1ccc(=O)[nH]c1=O