Reaction Details
TargetDelta-type opioid receptor
LigandBDBM50398704
Substrate/Competitorn/a
Meas. Tech.ChEMBL_874996 (CHEMBL2183872)
Ki>100000±n/a nM
Citation De Marco, RTolomelli, ASpampinato, SBedini, AGentilucci, L Opioid activity profiles of oversimplified peptides lacking in the protonable N-terminus. J Med Chem55:10292-6 (2012) 
 
Delta-type opioid receptor
Name:Delta-type opioid receptor
Type:G Protein-Coupled Receptor (GPCR)
Mol. Mass.:40382.98
Organism:Homo sapiens (Human)
Description:Competition binding assays were carried out using membrane preparations from transfected HN9.10 cells that constitutively expressed the delta opioid receptor.
Residue:372
BDBM50398704
NameBDBM50398704
Synonyms:CHEMBL2178729
TypeSmall organic molecule
Emp. Form.C17H26N6O3
Mol. Mass.362.4267
SMILESCC(=O)N[C@H](CCCNC(N)=N)C(=O)N[C@@H](Cc1ccccc1)C(N)=O