Reaction Details
TargetMu-type opioid receptor
LigandBDBM50398702
Substrate/Competitorn/a
Meas. Tech.ChEMBL_874994 (CHEMBL2183870)
IC50 37±n/a nM
Citation De Marco, RTolomelli, ASpampinato, SBedini, AGentilucci, L Opioid activity profiles of oversimplified peptides lacking in the protonable N-terminus. J Med Chem55:10292-6 (2012) 
 
Mu-type opioid receptor
Name:Mu-type opioid receptor
Type:G Protein-Coupled Receptor (GPCR)
Mol. Mass.:44789.51
Organism:Homo sapiens (Human)
Description:P35372
Residue:400
BDBM50398702
NameBDBM50398702
Synonyms:CHEMBL2178731
TypeSmall organic molecule
Emp. Form.C27H30N6O5
Mol. Mass.518.5643
SMILESNC(=O)[C@H]1CC(=O)NCCC(=O)N[C@H](Cc2c[nH]c3ccccc23)C(=O)N[C@@H](Cc2ccccc2)C(=O)N1