Reaction Details
TargetKappa-type opioid receptor
LigandBDBM50398706
Substrate/Competitorn/a
Meas. Tech.ChEMBL_874995 (CHEMBL2183871)
Ki>100000±n/a nM
Citation De Marco, RTolomelli, ASpampinato, SBedini, AGentilucci, L Opioid activity profiles of oversimplified peptides lacking in the protonable N-terminus. J Med Chem55:10292-6 (2012) 
 
Kappa-type opioid receptor
Name:Kappa-type opioid receptor
Type:G Protein-Coupled Receptor (GPCR)
Mol. Mass.:42648.76
Organism:Homo sapiens (Human)
Description:P41145
Residue:380
BDBM50398706
NameBDBM50398706
Synonyms:CHEMBL2178727
TypeSmall organic molecule
Emp. Form.C17H26N4O3
Mol. Mass.334.4133
SMILESCC(=O)N[C@H](CCCCN)C(=O)N[C@@H](Cc1ccccc1)C(N)=O