Reaction Details
TargetMu-type opioid receptor
LigandBDBM50398703
Substrate/Competitorn/a
Meas. Tech.ChEMBL_874997 (CHEMBL2183873)
Ki>100000±n/a nM
Citation De Marco, RTolomelli, ASpampinato, SBedini, AGentilucci, L Opioid activity profiles of oversimplified peptides lacking in the protonable N-terminus. J Med Chem55:10292-6 (2012) 
 
Mu-type opioid receptor
Name:Mu-type opioid receptor
Type:G Protein-Coupled Receptor (GPCR)
Mol. Mass.:44789.51
Organism:Homo sapiens (Human)
Description:P35372
Residue:400
BDBM50398703
NameBDBM50398703
Synonyms:CHEMBL2178730
TypeSmall organic molecule
Emp. Form.C19H29N7O4
Mol. Mass.419.4781
SMILES[#6]-[#6](=O)-[#7]-[#6@H](-[#6]-[#6]-[#6]\[#7]=[#6](\[#7])-[#7])-[#6](=O)-[#7]-[#6@@H](-[#6]-c1ccccc1)-[#6](=O)-[#7]-[#6]-[#6](-[#7])=O