Reaction Details
TargetInterleukin-1 receptor-associated kinase 1
LigandBDBM50347750
Substrate/Competitorn/a
Meas. Tech.ChEMBL_875222 (CHEMBL2186705)
Kd 930±n/a nM
Citation Tahtouh, TElkins, JMFilippakopoulos, PSoundararajan, MBurgy, GDurieu, ECochet, CSchmid, RSLo, DCDelhommel, FOberholzer, AEPearl, LHCarreaux, FBazureau, JPKnapp, SMeijer, L Selectivity, cocrystal structures, and neuroprotective properties of leucettines, a family of protein kinase inhibitors derived from the marine sponge alkaloid leucettamine B. J Med Chem55:9312-30 (2012) 
 
Interleukin-1 receptor-associated kinase 1
Name:Interleukin-1 receptor-associated kinase 1
Type:Enzyme
Mol. Mass.:76536.81
Organism:Homo sapiens (Human)
Description:P51617
Residue:712
BDBM50347750
NameBDBM50347750
Synonyms:CHEMBL1802358
TypeSmall organic molecule
Emp. Form.C17H13N3O3
Mol. Mass.307.3034
SMILESO=C1NC(Nc2ccccc2)=NC1=Cc1ccc2OCOc2c1