Reaction Details
TargetDual specificity protein kinase CLK2
LigandBDBM50347750
Substrate/Competitorn/a
Meas. Tech.ChEMBL_875431 (CHEMBL2182298)
IC50 720±n/a nM
Citation Tahtouh, TElkins, JMFilippakopoulos, PSoundararajan, MBurgy, GDurieu, ECochet, CSchmid, RSLo, DCDelhommel, FOberholzer, AEPearl, LHCarreaux, FBazureau, JPKnapp, SMeijer, L Selectivity, cocrystal structures, and neuroprotective properties of leucettines, a family of protein kinase inhibitors derived from the marine sponge alkaloid leucettamine B. J Med Chem55:9312-30 (2012) 
 
Dual specificity protein kinase CLK2
Name:Dual specificity protein kinase CLK2
Type:PROTEIN
Mol. Mass.:60021.57
Organism:Mus musculus
Description:ChEMBL_1502246
Residue:499
BDBM50347750
NameBDBM50347750
Synonyms:CHEMBL1802358
TypeSmall organic molecule
Emp. Form.C17H13N3O3
Mol. Mass.307.3034
SMILESO=C1NC(Nc2ccccc2)=NC1=Cc1ccc2OCOc2c1