Reaction Details
TargetCyclin-dependent kinase 5 activator 1
LigandBDBM50347750
Substrate/Competitorn/a
Meas. Tech.ChEMBL_875437 (CHEMBL2182304)
IC50>30000±n/a nM
Citation Tahtouh, TElkins, JMFilippakopoulos, PSoundararajan, MBurgy, GDurieu, ECochet, CSchmid, RSLo, DCDelhommel, FOberholzer, AEPearl, LHCarreaux, FBazureau, JPKnapp, SMeijer, L Selectivity, cocrystal structures, and neuroprotective properties of leucettines, a family of protein kinase inhibitors derived from the marine sponge alkaloid leucettamine B. J Med Chem55:9312-30 (2012) 
 
Cyclin-dependent kinase 5 activator 1
Name:Cyclin-dependent kinase 5 activator 1
Type:Protein Complex
Mol. Mass.:n/a
Description:n/a
Components:This complex has 2 components.
Component 1
Name:Cyclin-dependent kinase 5
Synonyms:CDK5 CDKN5 Cyclin-dependent kinase 5 (CDK5/ p25) Cyclin-dependent-like kinase 5 PSSALRE Tau protein kinase II catalytic subunit
Type:Enzyme Subunit
Mol. Mass.:33308.61
Organism:Homo sapiens (Human)
Description:n/a
Residue:292
Component 2
Name:Cyclin-dependent kinase 5 activator 1
Synonyms:CD5R1_HUMAN CDK5R1 Cyclin-dependent kinase 5 (CDK5/p25) NCK5A p35
Type:Enzyme Subunit
Mol. Mass.:34077.43
Organism:Homo sapiens (Human)
Description:Q15078
Residue:307
BDBM50347750
NameBDBM50347750
Synonyms:CHEMBL1802358
TypeSmall organic molecule
Emp. Form.C17H13N3O3
Mol. Mass.307.3034
SMILESO=C1NC(Nc2ccccc2)=NC1=Cc1ccc2OCOc2c1