Reaction Details
TargetDual specificity tyrosine-phosphorylation-regulated kinase 4
LigandBDBM100152
Substrate/Competitorn/a
Meas. Tech.ChEMBL_875248 (CHEMBL2187130)
IC50 9500±n/a nM
Citation Tahtouh, TElkins, JMFilippakopoulos, PSoundararajan, MBurgy, GDurieu, ECochet, CSchmid, RSLo, DCDelhommel, FOberholzer, AEPearl, LHCarreaux, FBazureau, JPKnapp, SMeijer, L Selectivity, cocrystal structures, and neuroprotective properties of leucettines, a family of protein kinase inhibitors derived from the marine sponge alkaloid leucettamine B. J Med Chem55:9312-30 (2012) 
 
Dual specificity tyrosine-phosphorylation-regulated kinase 4
Name:Dual specificity tyrosine-phosphorylation-regulated kinase 4
Type:PROTEIN
Mol. Mass.:59629.96
Organism:Homo sapiens (Human)
Description:ChEMBL_1475744
Residue:520
BDBM100152
NameBDBM100152
Synonyms:7-methoxy-1-methyl-9H-beta-carboline;hydrochloride HARMINE MLS002153910 cid_5359389
TypeSmall organic molecule
Emp. Form.C13H12N2O
Mol. Mass.212.2472
SMILESCOc1ccc2c(c1)[nH]c1c(C)nccc21