Reaction Details
TargetDual specificity protein kinase CLK4
LigandBDBM100152
Substrate/Competitorn/a
Meas. Tech.ChEMBL_875429 (CHEMBL2182296)
IC50 50±n/a nM
Citation Tahtouh, TElkins, JMFilippakopoulos, PSoundararajan, MBurgy, GDurieu, ECochet, CSchmid, RSLo, DCDelhommel, FOberholzer, AEPearl, LHCarreaux, FBazureau, JPKnapp, SMeijer, L Selectivity, cocrystal structures, and neuroprotective properties of leucettines, a family of protein kinase inhibitors derived from the marine sponge alkaloid leucettamine B. J Med Chem55:9312-30 (2012) 
 
Dual specificity protein kinase CLK4
Name:Dual specificity protein kinase CLK4
Type:PROTEIN
Mol. Mass.:57374.39
Organism:Mus musculus
Description:ChEMBL_1502248
Residue:481
BDBM100152
NameBDBM100152
Synonyms:7-methoxy-1-methyl-9H-beta-carboline;hydrochloride HARMINE MLS002153910 cid_5359389
TypeSmall organic molecule
Emp. Form.C13H12N2O
Mol. Mass.212.2472
SMILESCOc1ccc2c(c1)[nH]c1c(C)nccc21