Reaction Details
TargetHistone deacetylase 6
LigandBDBM50398720
Substrate/Competitorn/a
Meas. Tech.ChEMBL_875958 (CHEMBL2188464)
IC50 14±n/a nM
Citation Bergman, JAWoan, KPerez-Villarroel, PVillagra, ASotomayor, EMKozikowski, AP Selective histone deacetylase 6 inhibitors bearing substituted urea linkers inhibit melanoma cell growth. J Med Chem55:9891-9 (2012) 
 
Histone deacetylase 6
Name:Histone deacetylase 6
Type:Chromatin regulator; hydrolase; repressor
Mol. Mass.:131381.51
Organism:Homo sapiens (Human)
Description:Q9UBN7
Residue:1215
BDBM50398720
NameBDBM50398720
Synonyms:CHEMBL2179619 US9409858, 5h US9956192, Compound 5h
TypeSmall organic molecule
Emp. Form.C23H23N3O3
Mol. Mass.389.447
SMILESONC(=O)c1ccc(CN(CCc2ccccc2)C(=O)Nc2ccccc2)cc1