Reaction Details
TargetHistone deacetylase 6
LigandBDBM50398721
Substrate/Competitorn/a
Meas. Tech.ChEMBL_875958 (CHEMBL2188464)
IC50 9.26±n/a nM
Citation Bergman, JAWoan, KPerez-Villarroel, PVillagra, ASotomayor, EMKozikowski, AP Selective histone deacetylase 6 inhibitors bearing substituted urea linkers inhibit melanoma cell growth. J Med Chem55:9891-9 (2012) 
 
Histone deacetylase 6
Name:Histone deacetylase 6
Type:Chromatin regulator; hydrolase; repressor
Mol. Mass.:131381.51
Organism:Homo sapiens (Human)
Description:Q9UBN7
Residue:1215
BDBM50398721
NameBDBM50398721
Synonyms:CHEMBL2179617 US9409858, 5f US9956192, Compound 5f
TypeSmall organic molecule
Emp. Form.C18H21N3O4
Mol. Mass.343.377
SMILESCOCCN(Cc1ccc(cc1)C(=O)NO)C(=O)Nc1ccccc1