Reaction Details
TargetHistone deacetylase 6
LigandBDBM50398725
Substrate/Competitorn/a
Meas. Tech.ChEMBL_875958 (CHEMBL2188464)
IC50 2.38±n/a nM
Citation Bergman, JAWoan, KPerez-Villarroel, PVillagra, ASotomayor, EMKozikowski, AP Selective histone deacetylase 6 inhibitors bearing substituted urea linkers inhibit melanoma cell growth. J Med Chem55:9891-9 (2012) 
 
Histone deacetylase 6
Name:Histone deacetylase 6
Type:Chromatin regulator; hydrolase; repressor
Mol. Mass.:131381.51
Organism:Homo sapiens (Human)
Description:Q9UBN7
Residue:1215
BDBM50398725
NameBDBM50398725
Synonyms:CHEMBL2179249 US9409858, 5b US9956192, Compound 5b
TypeSmall organic molecule
Emp. Form.C19H23N3O5
Mol. Mass.373.403
SMILESCOc1ccccc1NC(=O)N(CCCO)Cc1ccc(cc1)C(=O)NO