Reaction Details
TargetHistone deacetylase 6
LigandBDBM50398727
Substrate/Competitorn/a
Meas. Tech.ChEMBL_875958 (CHEMBL2188464)
IC50 139±n/a nM
Citation Bergman, JAWoan, KPerez-Villarroel, PVillagra, ASotomayor, EMKozikowski, AP Selective histone deacetylase 6 inhibitors bearing substituted urea linkers inhibit melanoma cell growth. J Med Chem55:9891-9 (2012) 
 
Histone deacetylase 6
Name:Histone deacetylase 6
Type:Chromatin regulator; hydrolase; repressor
Mol. Mass.:131381.51
Organism:Homo sapiens (Human)
Description:Q9UBN7
Residue:1215
BDBM50398727
NameBDBM50398727
Synonyms:CHEMBL2179247 US9956192, Compound 1
TypeSmall organic molecule
Emp. Form.C16H17N3O4
Mol. Mass.315.3239
SMILESCOc1ccccc1NC(=O)NCc1ccc(cc1)C(=O)NO